{"text_format":"1","workbook":"xlsx","n_sheets":6,"sheets":["Instrucciones","Formulario 2- Planta","Formulario 2A - Nómina","Formulario 2B- Programático","DESPLEGABLES","Programático"],"not_rendered":{"charts":0,"images":6,"macros":0,"external_links":2,"defined_names":41,"comments":3,"pivot_tables":0},"unopened":[],"bounds":{"document_bytes":16777216,"sheet_cells":100000,"rows_first":2000,"rows_last":500,"rows_between":2000,"halvings":0,"cell_chars":16384,"cell_head_chars":4096},"cells_cut":0,"cells_raw":0,"read":"whole","date_system":"1900"}

{"sheet":"Instrucciones","index":0,"n_rows":183,"n_cols":1,"rows_kept":183,"cut":false,"hidden":false,"merged":[]}
[]
[]
[]
["Formulario 2. Anteproyecto Planta de personal"]
[]
["La información contenida en este formulario permitirá calcular el valor de los gastos asociados a la planta a servicio de la entidad, lo cual, constituye una base de datos para facilitar la toma de decisiones en materia presupuestal."]
[]
["El formulario 2, considera los diferentes niveles ocupacionales que posee cada planta de personal, distinguiendo el tipo de vinculación laboral que existe en el respectivo órgano. Para tal fin, se debe especificar la denominación de los cargos, grados, número de cargos y asignación básica vigente. Esta información servirá de base para calcular los gastos que se generen por: Salario (Factores salariales comunes, Factores salariales especiales), Remuneraciones no constitutivas de factor salarial (Prestaciones sociales según definición legal y otras remuneraciones no constitutivas de factor salarial), las contribuciones inherentes a la nómina y los gastos que, de acuerdo con su naturaleza económica son de la cuenta de transferencias, pero para efectos analíticos son parte de las erogaciones que realiza una entidad a favor de sus funcionarios, tales como: el reconocimiento y pago de incapacidades y las licencias de maternidad y paternidad. Clasificando esta información por objeto de gasto de acuerdo con el Catálogo de Clasificación Presupuestal establecido por la DGPPN. "]
[]
["Es importante que el funcionario tenga claridad respecto del régimen salarial aplicable a los funcionarios de la entidad objeto de programación y por tanto la base legal que soporta cada uno de los conceptos de reconocimiento, las modificaciones que se hayan autorizado sobre las plantas de personal y la nómina certificada registrada en formulario No. 2A, las normas sobre control de gasto público como la Ley 617 de 2000, así como los criterios de programación establecidos por el gobierno en cumplimiento de la restricción fiscal que garantice la sostenibilidad de las finanzas públicas. "]
{"$rows_left_out":174}
{"sheet":"Formulario 2- Planta","index":1,"n_rows":226,"n_cols":48,"rows_kept":226,"cut":false,"hidden":false,"merged":[[217,12,218,14],[219,12,220,14],[221,12,222,14],[205,12,206,14],[207,12,208,14],[209,12,210,14],[211,12,212,14],[213,12,214,14],[221,6,222,8],[219,6,220,8],[217,6,218,8],[215,6,216,8],[213,6,214,8],[211,6,212,8],[209,6,210,8],[207,6,208,8],[205,6,206,8],[11,44,13,44],[11,45,13,45],[10,44,10,46],[11,46,13,46],[11,43,13,43],[11,33,13,33],[11,34,13,34],[11,35,13,35],[11,36,13,36],[11,42,13,42],[11,41,13,41],[11,37,13,37],[11,38,13,38],[11,40,13,40],[12,19,13,19],[12,20,13,20],[11,22,13,22],[11,39,13,39],[12,21,13,21],[12,23,13,23],[12,24,13,24],[12,26,13,26],[12,25,13,25],[12,30,13,30],[11,23,11,26],[12,31,13,31],[11,32,13,32],[4,1,4,11],[10,33,10,43],[10,47,13,47],[10,2,13,2],[10,3,10,22],[11,3,11,16],[11,17,11,21],[12,3,12,4],[12,5,13,5],[10,23,10,32],[11,27,11,31],[12,27,13,27],[12,28,13,28],[12,29,13,29],[12,11,13,11],[12,12,13,12],[12,13,13,13],[12,16,13,16],[12,14,13,14],[12,6,13,6],[12,7,13,7],[12,8,13,8],[12,9,13,9],[12,10,13,10],[217,2,218,5],[200,2,202,5],[203,2,204,5],[12,17,13,17],[12,18,13,18],[205,2,206,5],[5,1,5,11],[8,3,8,10],[10,0,13,0],[10,1,13,1],[12,15,13,15],[207,2,208,5],[203,12,204,14],[203,9,204,11],[213,9,214,11],[211,9,212,11],[209,9,210,11],[207,9,208,11],[205,9,206,11],[201,9,202,11],[203,6,204,8],[200,12,202,14],[200,6,200,11],[215,12,216,14],[0,0,0,15],[1,0,1,15],[2,0,2,15],[6,1,6,11],[223,2,224,5],[225,2,226,5],[223,6,224,8],[225,6,226,8],[223,9,224,11],[223,12,224,14],[225,9,226,11],[225,12,226,14],[199,2,199,6],[221,9,222,11],[219,9,220,11],[217,9,218,11],[215,9,216,11],[219,2,220,5],[221,2,222,5],[201,6,202,8],[209,2,210,5],[211,2,212,5],[213,2,214,5],[215,2,216,5]]}
["MINISTERIO DE HACIENDA Y CRÉDITO PÚBLICO "]
["Dirección General del Presupuesto Público Nacional"]
["Formulario 2. Anteproyecto Planta de personal"]
[]
["CÓDIGO UEJ","130101"]
["UNIDAD EJECUTORA",{"$f":"+IFERROR(VLOOKUP(B5,DESPLEGABLES!$A$2:$C$229,2,0),\"\")","v":"MINISTERIO DE HACIENDA Y CRÉDITO PÚBLICO - GESTIÓN GENERAL"}]
["SECTOR PRESUPUESTAL",{"$f":"+IFERROR(VLOOKUP(B5,DESPLEGABLES!$A$2:$C$229,3,0),\"\")","v":"HACIENDA"}]
[]
[null,null,null,"ANTEPROYECTO PLANTA DE PERSONAL - VIGENCIA",null,null,null,null,null,null,null,2027,null,null,"(diligenciar en pesos)"]
[]
{"$rows_left_out":217}
{"sheet":"Formulario 2A - Nómina","index":2,"n_rows":66,"n_cols":9,"rows_kept":66,"cut":false,"hidden":false,"merged":[[8,1,8,4],[0,0,0,9],[1,0,1,9],[2,0,2,9],[4,2,4,8],[5,2,5,8],[8,5,8,7],[6,2,6,8],[64,7,64,8],[65,7,65,8],[10,1,12,1],[10,2,12,2],[10,3,12,3],[10,4,10,6],[10,7,12,7],[10,8,12,8],[11,4,12,4],[11,5,11,6]]}
["MINISTERIO DE HACIENDA Y CRÉDITO PÚBLICO "]
["Dirección General del Presupuesto Público Nacional"]
["Formulario 2A Certificación de Nómina"]
[]
[null,"CÓDIGO UEJ",{"$f":"+'Formulario 2- Planta'!B5","v":"130101"}]
[null,"UNIDAD EJECUTORA",{"$f":"+IFERROR(VLOOKUP(C5,DESPLEGABLES!$A$2:$C$229,2,0),\"\")","v":"MINISTERIO DE HACIENDA Y CRÉDITO PÚBLICO - GESTIÓN GENERAL"}]
[null,"SECTOR PRESUPUESTAL",{"$f":"+IFERROR(VLOOKUP(C5,DESPLEGABLES!$A$2:$C$229,3,0),\"\")","v":"HACIENDA"}]
[]
[null,"ANTEPROYECTO COSTO DE NÓMINA - VIGENCIA",null,null,null,{"$f":"+'Formulario 2- Planta'!L9","v":2027}]
[]
{"$rows_left_out":57}
{"sheet":"Formulario 2B- Programático","index":3,"n_rows":203,"n_cols":26,"rows_kept":203,"cut":false,"hidden":false,"merged":[[201,1,201,12],[202,1,202,12],[197,1,197,12],[198,1,198,12],[199,1,199,12],[9,10,9,17],[200,1,200,12],[9,18,10,19],[168,0,168,9],[169,0,169,9],[195,1,195,12],[196,1,196,12],[5,1,5,9],[0,0,0,19],[1,0,1,19],[2,0,2,19],[4,1,4,9],[6,1,6,9],[9,0,10,0],[9,1,10,1],[9,2,10,2],[9,3,10,3],[9,5,10,5],[9,7,10,7],[9,9,10,9],[7,1,7,9]]}
["MINISTERIO DE HACIENDA Y CRÉDITO PÚBLICO "]
["Dirección General del Presupuesto Público Nacional"]
["Formulario 2B. Anteproyecto Planta de personal - Clasificador Programatico"]
[]
["CÓDIGO UEJ",{"$f":"+'Formulario 2- Planta'!B5","v":"130101"}]
["UNIDAD EJECUTORA",{"$f":"+IFERROR(VLOOKUP(B5,DESPLEGABLES!$A$2:$C$229,2,0),\"\")","v":"MINISTERIO DE HACIENDA Y CRÉDITO PÚBLICO - GESTIÓN GENERAL"}]
["SECTOR PRESUPUESTAL",{"$f":"+IFERROR(VLOOKUP(B5,DESPLEGABLES!$A$2:$C$229,3,0),\"\")","v":"HACIENDA"}]
["VIGENCIA",{"$f":"+'Formulario 2- Planta'!L9","v":2027}]
[]
["DENOMINACIÓN DE CARGOS","Grado","No. Cargos","Total Salario",null,"Total Remuneraciones no constitutivas de Factor Salarial",null,"Total Contribuciones Inherentes a la Nómina",null,"Total  \nGastos de personal","Dependencias con fines programaticos",null,null,null,null,null,null,null,"CHECK"]
{"$rows_left_out":194}
{"sheet":"DESPLEGABLES","index":4,"n_rows":223,"n_cols":38,"rows_kept":223,"cut":false,"hidden":true,"merged":[]}
["CÓDIGO","UNIDAD EJECUTORA ","SECTOR",null,"FONDOS ESPECIALES ","COD",null,"IMPUESTOS INDIRECTOS -FE","CÓD ",null,"CONTRIBUCIONES SOCIALES- EP","CÓD",null,"CONTRIBUCIONES SOCIALES -FE","CÓD",null,"CONTRIBUCIONES DIVERSAS - FE","CÓD",null,"CONTRIBUCIONES DIVERSAS - ESTAPÚBLICO","CÓD",null,"TASAS Y DERECHOS ADMINISTRATIVOS - EP","CÓD",null,"DERECHOS ECONÓMICOS POR USO DE RECURSOS NATURALES- EP","CÓD",null,"DERECHOS ECONÓMICOS POR USO DE RECURSOS NATURALES- FE","CÓD",null,"TRANSFERENCIAS CORRIENTES- EP","CÓD",null,"TRANSFERENCIAS CORRIENTES- FE","CÓD",null,"CPC"]
["010101","SENADO DE LA REPUBLICA","CONGRESO DE LA REPÚBLICA",null,"CONTRIBUCIÓN ENTIDADES VIGILADAS CONTRALORIA GENERAL NACION",602,null,"Impuesto social a las armas y municiones",10,null,"Salud","01",null,"Salud","01",null,"Contribución - Comisión de Regulación de Comunicaciones (CRC)","01",null,"Contribución - Superintendencia de Sociedades","04",null,"Expedición de visas","01",null,"Derecho económico por uso del subsuelo","01",null,"Autorización de uso de zonas de fondeo - DIMAR ","06",null,"Indemnizaciones relacionadas con seguros no de vida","01",null,"Indemnizaciones relacionadas con seguros no de vida","01",null,"Agricultura, silvicultura y productos de la pesca"]
["010102","CAMARA DE REPRESENTANTES","CONGRESO DE LA REPÚBLICA",null,"CONTRIBUCIÓN ENTIDADES VIGILADAS SUPERINTENDENCIA SUBSIDIO FAMILIAR",603,null,"Impuesto de remate y adjudicaciones",11,null,"Pensión","02",null,"Pensión","02",null,"Contribución - Comisión de Regulación de Energía y Gas (CREG)","02",null,"Contribución - Superintendencia de Vigilancia y Seguridad Privada","05",null,"Expedición de pasaportes","02",null,"Concesiones mineras","02",null,null,null,null,"Sentencias y conciliaciones","02",null,"Sentencias y conciliaciones","02",null,"Minerales; electricidad, gas y agua"]
["020101","PRESIDENCIA DE LA REPUBLICA - GESTION GENERAL","PRESIDENCIA DE LA REPÚBLICA",null,"FINANCIACION SECTOR JUSTICIA",609,null,"Sobretasa nacional a la gasolina",12,null,"Contribuciones asignaciones de retiro militares y policía","03",null,null,null,null,"Contribución - Comisión de Regulación de Agua Potable y Saneamiento Básico (CRA)","03",null,"Contribución - Superintendencia de la Economía Solidaria","06",null,"Apostilla o legalización","03",null,"Contraprestaciones portuarias","03",null,null,null,null,"Devolución IVA - Instituciones de educación superior ","04",null,"Prescripción de depósitos judiciales","03",null,"Productos alimenticios, bebidas y tabaco; textiles, prendas de vestir y productos de cuero"]
["020900","AGENCIA PRESIDENCIAL DE COOPERACION INTERNACIONAL DE COLOMBIA, APC - COLOMBIA ","PRESIDENCIA DE LA REPÚBLICA",null,"FONDO DE DEFENSA NACIONAL","6010",null,"Sobretasa al ACPM",13,null,null,null,null,null,null,null,"Contribución - Superintendencia del Subsidio Familiar","07",null,"Contribución de vigilancia - Superintendencia de Industria y Comercio","07",null,"Protocolización de escrituras públicas","04",null,"Concesiones parques naturales","05",null,null,null,null,"Transferencias de otras unidades de gobierno","05",null,"Devolución IVA - Instituciones de educación superior","04",null,"Otros bienes transportables, (excepto productos metálicos, maquinaria y equipo)"]
["021100","UNIDAD NACIONAL PARA LA GESTION DEL RIESGO DE DESASTRES ","PRESIDENCIA DE LA REPÚBLICA",null,"FONDO ESTUPEFACIENTES - MINSALUD","6013",null,"Impuesto de salida",15,null,"CONTRIBUCIONES ASOCIADAS A NÓMINA - EP","CÓD",null,"CONTRIBUCIONES ASOCIADAS A NÓMINA -FE","CÓD",null,"Contribución - Fondo de Compensación Ambiental",13,null,"Contribución de seguimiento - Superintendencia de Industria y Comercio","09",null,"Expedición de certificaciones en el exterior","05",null,null,null,null,null,null,null,"Recursos por bienes mostrencos y vocaciones hereditarias","07",null,"Transferencias de otras unidades de gobierno","05",null,"Productos metálicos, maquinaria y equipo"]
["021200","AGENCIA PARA LA REINCORPORACION Y LA NORMALIZACION - ARN","PRESIDENCIA DE LA REPÚBLICA",null,"FONDOS INTERNOS MINISTERIO DEFENSA","6014",null,null,null,null,"ICBF","01",null,"Escuelas industriales e institutos técnicos","04",null,"Contribución - Fondo Apoyo Financiero Zonas No Interconectadas (FAZNI) ",14,null,"Contribución - Superintendencia Financiera de Colombia","10",null,"Certificación sobre la existencia legal de sociedades","06",null,null,null,null,null,null,null,"Compensación UPC – SSS","09",null,"Recursos de terceros en consignación ","06",null,"Construcción y servicios de la construcción"]
["021300","AGENCIA NACIONAL INMOBILIARIA VIRGILIO BARCO VARGAS","PRESIDENCIA DE LA REPÚBLICA",null,"FONDOS INTERNOS POLICIA NACIONAL","6015",null,null,null,null,"SENA","02",null,"Aportes de cesantías","05",null,"Contribución - Fondo Apoyo Financiero para la Energización de las Zonas Rurales Interconectadas (FAER)",15,null,"Contribución - Superintendencia de Servicios Públicos Domiciliarios","11",null,"Reconocimiento y autenticación de firmas ante cónsules colombianos","07",null,"CÁLCULO POR INGRESOS CORRIENTES",null,null,null,null,null,"Mercancías Aprehendidas, Decomisadas o Abandonadas","11",null,"Recursos por procesos de extinción de dominio","08",null,"Servicios de venta y de distribución; alojamiento; servicios de suministro de comidas y bebidas; servicios de transporte; y servicios de distribución de electricidad, gas y agua"]
["021401","AGENCIA DE RENOVACION DEL TERRITORIO ART - GESTION GENERAL","PRESIDENCIA DE LA REPÚBLICA",null,"FONDO ROTATORIO DE MINAS Y ENERGÍA","6017",null,null,null,null,"ESAP","03",null,null,null,null,"Contribución - Fondo de Energías No Convencionales y Gestión Eficiente de la Energía (FENOGE)",16,null,"Contribucción - Superintendencia de Puertos y Transporte",12,null,"Expedición de tarjetas de registro consular","08",null,null,null,null,null,null,null,null,null,null,"Compensación UPC – SSS","09",null,"Servicios financieros y servicios conexos, servicios inmobiliarios y servicios de leasing"]
["021402","DIRECCIÓN DE SUSTITUCIÓN DE CULTIVOS DE USO ILÍCITO","PRESIDENCIA DE LA REPÚBLICA",null,"ESCUELAS INDUSTRIALES E INSTITUTOS TECNICOS","6019",null,null,null,null,null,null," ",null,null,null,"Contribución - Fondo Especial de Energía Social (FOES)",17,null,"Contribucción pensionados militares y policia",23,null,"Trámite de nacionalidad colombiana por adopción","09",null,"CONTRIBUCIONES SOCIALES- EP",null,null,"TASAS Y DERECHOS ADMINISTRATIVOS - EP",null,null,"IMPUESTOS INDIRECTOS -FE",null,null,"Recursos FRISCO",10,null,"Servicios prestados a las empresas y servicios de producción"]
{"$rows_left_out":214}
{"sheet":"Programático","index":5,"n_rows":1021,"n_cols":35,"rows_kept":1021,"cut":false,"hidden":true,"merged":[[0,0,0,9],[0,11,0,16]]}
["FUNCIONAMIENTO",null,null,null,null,null,null,null,null,null,null,"INVERSIÓN"]
["Código sector","Sector","Código programa","Programa","Código Subprograma","Subprograma","Código producto Final ","Producto Final ","Código operación de funcionamiento","Operación de funcionamiento",null,"Código sector","Sector","Código programa","Programa","Código Subprograma","Subprograma",null,null,"Sector","Programa 01","Programa 02","Programa 03","Programa 04","Programa 05","Programa 06","Programa 07","Programa 08","Programa 09","Programa 10","Programa 11","Programa 12","Programa 13","Programa 14","Conteo"]
[17,"AGRICULTURA Y DESARROLLO RURAL",1702,"Inclusión Productiva de pequeños productores rurales ","1100","Intersubsectorial Agricultura","01","Servicio de fortalecimiento de las capacidades productivas de los pequeños agricultores","01","Direccionamiento estratégico del sector ",null,17,"AGRICULTURA Y DESARROLLO RURAL",1702,"Inclusión Productiva de pequeños productores rurales ","1100","Intersubsectorial Agricultura",null,null,"AGRICULTURA Y DESARROLLO RURAL","1702 Inclusión Productiva de pequeños productores rurales ","1703 Servicios financieros y gestión del riesgo para las actividades agropecuarias y rurales","1704 Ordenamiento social y uso productivo del territorio rural ","1705 Restitución de tierras a víctimas del conflicto armado","1706 Aprovechamiento de mercados externos","1707 Sanidad agropecuaria e inocuidad agroalimentaria ","1708 Ciencia, tecnología e innovación agropecuaria","1709 Infraestructura productiva y comercialización ","1799 fortalecimiento y apoyo a la gestión institucional del sector Agricultura y Desarrollo Rural","2501 Fortalecimiento del control y la vigilancia de la gestión fiscal y resarcimiento al daño del patrimonio público","3606 Protección Económica para la Vejez","1700 No asignable a programas",null,null,{"$f":"COUNTA(U3:AH3)","v":12}]
[17,"AGRICULTURA Y DESARROLLO RURAL",1702,"Inclusión Productiva de pequeños productores rurales ","1100","Intersubsectorial Agricultura","01","Servicio de fortalecimiento de las capacidades productivas de los pequeños agricultores","02","Gestión de políticas de apoyo productivo a los pequeños productores rurales",null,17,"AGRICULTURA Y DESARROLLO RURAL",1703,"Servicios financieros y gestión del riesgo para las actividades agropecuarias y rurales","1100","Intersubsectorial Agricultura",null,null,"AMBIENTE Y DESARROLLO SOSTENIBLE","3201 Fortalecimiento del desempeño ambiental de los sectores productivos","3202 Conservación de la biodiversidad y sus servicios ecosistémicos","3203 Gestión Integral del Recurso Hídrico","3204 Gestión de la información y el conocimiento ambiental","3205 Ordenamiento ambiental territorial","3206 Gestión del cambio climático para un desarrollo bajo en carbono y resiliente al clima","3207 Gestión integral de mares, costas y recursos acuáticos","3208 Educación Ambiental","3299 Fortalecimiento y apoyo a la gestión institucional del sector Ambiente y Desarrollo Sostenible","3606 Protección Económica para la Vejez","2501 Fortalecimiento del control y la vigilancia de la gestión fiscal y resarcimiento al daño del patrimonio público","3200 No asignable a programas",null,null,{"$f":"COUNTA(U4:AH4)","v":12}]
[17,"AGRICULTURA Y DESARROLLO RURAL",1702,"Inclusión Productiva de pequeños productores rurales ","1100","Intersubsectorial Agricultura","01","Servicio de fortalecimiento de las capacidades productivas de los pequeños agricultores","03","Gestión de asitencia técnica ",null,17,"AGRICULTURA Y DESARROLLO RURAL",1704,"Fortalecimiento de la gestión y dirección del sector Agricultura y Desarrollo Rural","1100","Intersubsectorial Agricultura",null,null,"CIENCIA, TECNOLOGÍA E INNOVACIÓN","3905 Fortalecimiento de la gobernanza e institucionalidad multinivel del sector de CTeI","3906 Fomento a vocaciones y formación, generación, uso y apropiación social del conocimiento de la Ciencia, Tecnología e Innovación","3999 Fortalecimiento y apoyo a la gestión institucional del sector Ciencia, Tecnología e Innovación","2501 Fortalecimiento del control y la vigilancia de la gestión fiscal y resarcimiento al daño del patrimonio público","3900 No asignable a programas",null,null,null,null,null,null,null,null,null,5]
[17,"AGRICULTURA Y DESARROLLO RURAL",1702,"Inclusión Productiva de pequeños productores rurales ","1100","Intersubsectorial Agricultura","01","Servicio de fortalecimiento de las capacidades productivas de los pequeños agricultores","04","Gestión de acceso a activos productivos",null,17,"AGRICULTURA Y DESARROLLO RURAL",1705,"Restitución de tierras a víctimas del conflicto armado","1100","Intersubsectorial Agricultura",null,null,"COMERCIO, INDUSTRIA Y TURISMO","3501 Internacionalización de la economía ","3502 Productividad y competitividad de las empresas colombianas ","3503 Ambiente regulatorio y económico para la competencia y la actividad empresarial","3504 Competitividad, sostenibilidad y promoción del turismo colombiano ","3599 Fortalecimiento y apoyo a la gestión institucional del sector Comercio, Industria y Turismo","3606 Protección Económica para la Vejez","2501 Fortalecimiento del control y la vigilancia de la gestión fiscal y resarcimiento al daño del patrimonio público","3500 No asignable a programas",null,null,null,null,null,null,8]
[17,"AGRICULTURA Y DESARROLLO RURAL",1702,"Inclusión Productiva de pequeños productores rurales ","1100","Intersubsectorial Agricultura","01","Servicio de fortalecimiento de las capacidades productivas de los pequeños agricultores","05","Promoción y fomento de proyectos de pequeños productores",null,17,"AGRICULTURA Y DESARROLLO RURAL",1706,"Aprovechamiento de mercados externos","1100","Intersubsectorial Agricultura",null,null,"CONGRESO DE LA REPÚBLICA","0101 Mejoramiento de la eficiencia y la transparencia legislativa","0199 Fortalecimiento y apoyo a la gestión institucional del sector Congreso de la República ","2501 Fortalecimiento del control y la vigilancia de la gestión fiscal y resarcimiento al daño del patrimonio público","0100 No asignable a programas",null,null,null,null,null,null,null,null,null,null,4]
[17,"AGRICULTURA Y DESARROLLO RURAL",1703,"Servicios financieros y gestión del riesgo para las actividades agropecuarias y rurales","1100","Intersubsectorial Agricultura","01","servicio de inclusión financiera para los productores rurales ","01","Direccionamiento estratégico del sector ",null,17,"AGRICULTURA Y DESARROLLO RURAL",1707,"Sanidad agropecuaria e inocuidad agroalimentaria ","1100","Intersubsectorial Agricultura",null,null,"CULTURA","3301 Promoción y acceso efectivo a procesos culturales y artísticos","3302 Gestión, protección y salvaguardia del patrimonio cultural colombiano","3399 Fortalecimiento y apoyo a la gestión institucional del sector Cultura","2202 Calidad y fomento de la educación superior","2501 Fortalecimiento del control y la vigilancia de la gestión fiscal y resarcimiento al daño del patrimonio público","3300 No asignable a programas",null,null,null,null,null,null,null,null,6]
[17,"AGRICULTURA Y DESARROLLO RURAL",1703,"Servicios financieros y gestión del riesgo para las actividades agropecuarias y rurales","1100","Intersubsectorial Agricultura","01","servicio de inclusión financiera para los productores rurales ","02","Gestión de la política de inclusión financiera para los productores rurales",null,17,"AGRICULTURA Y DESARROLLO RURAL",1708,"Ciencia, tecnología e innovación agropecuaria","1100","Intersubsectorial Agricultura",null,null,"DEFENSA Y POLICÍA","1501 Capacidades de la Policía Nacional en seguridad pública, prevención, convivencia y seguridad ciudadana","1502 Capacidades de las Fuerzas Militares en \nseguridad pública y defensa en el territorio  nacional","1504 Desarrollo marítimo, fluvial y costero desde el sector defensa","1505 Generación de bienestar para la Fuerza Pública y sus familias","1506 Gestión del riesgo de desastres desde el sector Defensa y Seguridad","1507 Grupo Social y Empresarial de la Defensa (GSED) competitivo","1599 Fortalecimiento y apoyo a la gestión institucional del sector Defensa y Policía","1903 Inspección, vigilancia y control","2202 Calidad y fomento de la educación superior","2501 Fortalecimiento del control y la vigilancia de la gestión fiscal y resarcimiento al daño del patrimonio público","3606 Protección Económica para la Vejez","3705 Protección de personas, grupos y comunidades en riesgo extraordinario y extremo Unidad Nacional de Protección (UNP)","1207 Fortalecimiento de la política criminal del Estado colombiano","1500 No asignable a programas",14]
[17,"AGRICULTURA Y DESARROLLO RURAL",1703,"Servicios financieros y gestión del riesgo para las actividades agropecuarias y rurales","1100","Intersubsectorial Agricultura","01","servicio de inclusión financiera para los productores rurales ","03","Gestión de cofinanciación para proyectos productivos ",null,17,"AGRICULTURA Y DESARROLLO RURAL",1709,"Infraestructura productiva y comercialización ","1100","Intersubsectorial Agricultura",null,null,"DEPORTE Y RECREACIÓN","4301 Fomento a la recreación, la actividad física y el deporte","4302 Formación y preparación de deportistas","4399 Fortalecimiento y apoyo a la gestión institucional del sector Deporte y Recreación","2202 Calidad y fomento de la educación superior","2501 Fortalecimiento del control y la vigilancia de la gestión fiscal y resarcimiento al daño del patrimonio público","3606 Protección Económica para la Vejez","4300 No asignable a programas",null,null,null,null,null,null,null,7]
{"$rows_left_out":1011}